{"text_format":"1","workbook":"xlsx","n_sheets":8,"sheets":["Result","Balance ","P&L report","!Key Ratios","Ranking desciption","Предоставить расшифровки","Поручитель","Financial ranking"],"not_rendered":{"charts":0,"images":0,"macros":0,"external_links":0,"defined_names":3,"comments":1,"pivot_tables":0},"unopened":[],"bounds":{"document_bytes":16777216,"sheet_cells":100000,"rows_first":2000,"rows_last":500,"rows_between":2000,"halvings":0,"cell_chars":16384,"cell_head_chars":4096},"cells_cut":0,"cells_raw":0,"read":"whole","date_system":"1900"}

{"sheet":"Result","index":0,"n_rows":17,"n_cols":4,"rows_kept":17,"cut":false,"hidden":true,"merged":[]}
[null,"GC …."]
["Main activity ","Automotive business (sales and service) "]
["Building","Building is own / rent"]
["Final ranking",{"$f":"'!Key Ratios'!AB13","v":{"$error":"#DIV/0!"}},{"$f":"'!Key Ratios'!AB14","v":{"$error":"#DIV/0!"}}]
["Equity ratio > 40%\n(Equity / Total BS value)","\nIt is positive / negative due to ….",{"$f":"'!Key Ratios'!P9","v":{"$error":"#DIV/0!"}}]
["Retained earnings","... MRUR (+….% vs 30.06.17)",{"$f":"'Balance '!P62","v":0},{"$f":"'Balance '!S62","v":{"$error":"#DIV/0!"}}]
["Current liquidity ratio >1.4\n(Current assets/Current liabilities)","\nThe main sum of current assets is ... (...% from TTL balance)",{"$f":"'!Key Ratios'!Q10","v":{"$error":"#DIV/0!"}}]
["ISCR > 4.5\nNet Operating Income (Sales profit or loss + Bonus + Depreciation) / Interest payable",{"$f":"'!Key Ratios'!P11","v":{"$error":"#DIV/0!"}}]
["Credit burden (debts/EBITDA) < 3\nDebt (long-term + short-term liabilities - cash) / EBITDA","...\nCredits – …. Krur from ….",{"$f":"'!Key Ratios'!O22","v":{"$error":"#DIV/0!"}},{"$f":"'Balance '!P66+'Balance '!P74","v":0}]
["ROS (%)",{"$f":"'!Key Ratios'!P12","v":{"$error":"#DIV/0!"}}]
{"$rows_left_out":8}
{"sheet":"Balance ","index":1,"n_rows":114,"n_cols":20,"rows_kept":114,"cut":false,"hidden":false,"merged":[]}
[null,null,"Баланс/Balance"]
[]
[null,null,"Название компании","заполнить"]
[null,null,"ИНН","заполнить"]
[null,null,"Список брендов/марок на данном юр. лице","заполнить"]
[]
[null,null,"Единица измерения - тыс. руб","тыс. руб.(KRUR)",null,null,null,null,null,null,"ThsRUB"]
[null,null,"АКТИВ","ASSETS","2018-12-31","2019-03-31","2019-06-30","2019-09-30","2019-12-31","2020-03-31","2020-06-30","2020-09-30","2020-12-31","2021-03-31","2021-06-30","2021-09-30","2021-12-31","change in % vs 2019","change in % vs 2020","% of BS"]
[null,null,"I. ВНЕОБОРОТНЫЕ АКТИВЫ","I. NON-CURRENT ASSETS"]
[null,null,"Нематериальные активы","Intangible assets",null,null,null,null,null,null,null,null,null,null,null,null,null,{"$f":"(M10/I10)-1","v":{"$error":"#DIV/0!"}},{"$f":"(Q10/M10)-1","v":{"$error":"#DIV/0!"}},{"$f":"Q10/$Q$51","v":{"$error":"#DIV/0!"}}]
{"$rows_left_out":105}
{"sheet":"P&L report","index":2,"n_rows":38,"n_cols":21,"rows_kept":38,"cut":false,"hidden":false,"merged":[[24,20,24,26],[16,20,16,26]]}
[null,null,"Отчет о прибылях и убытках / P&L"]
[]
[null,null,"Название компании",{"$f":"'Balance '!D3","v":"заполнить"}]
[null,null,"ИНН",{"$f":"'Balance '!D4","v":"заполнить"}]
[null,null,"Вид деятельности с указанием брендов",{"$f":"'Balance '!D5","v":"заполнить"}]
[]
[null,null,"Единица измерения - тыс.руб.","тыс. руб.(KRUR)",null,null,null,null,null,null,"ThsRUB"]
[null,null,"Наименование показателя","Item",{"$f":"'Balance '!E8","v":"2018-12-31"},{"$f":"'Balance '!F8","v":"2019-03-31"},{"$f":"'Balance '!G8","v":"2019-06-30"},{"$f":"'Balance '!H8","v":"2019-09-30"},{"$f":"'Balance '!I8","v":"2019-12-31"},{"$f":"'Balance '!J8","v":"2020-03-31"},{"$f":"'Balance '!K8","v":"2020-06-30"},{"$f":"'Balance '!L8","v":"2020-09-30"},{"$f":"'Balance '!M8","v":"2020-12-31"},{"$f":"'Balance '!N8","v":"2021-03-31"},{"$f":"'Balance '!O8","v":"2021-06-30"},{"$f":"'Balance '!P8","v":"2021-09-30"},{"$f":"'Balance '!Q8","v":"2021-12-31"},"change in % vs 2018","change in % vs 2019","% of revenue"]
[null,null,"Выручка (нетто) от реализации товаров, продукции, работ, услуг","Revenue (net) from sales of goods and services",null,null,null,null,null,null,null,null,null,null,null,null,null,{"$f":"(M9/I9)-1","v":{"$error":"#DIV/0!"}},{"$f":"(Q9/M9)-1","v":{"$error":"#DIV/0!"}},{"$f":"Q9/$Q$9","v":{"$error":"#DIV/0!"}}]
[null,null,"В т.ч. от основной деятельности","i.e from principal activity",null,null,null,null,null,null,null,null,null,null,null,null,null,{"$f":"(M10/I10)-1","v":{"$error":"#DIV/0!"}},{"$f":"(Q10/M10)-1","v":{"$error":"#DIV/0!"}},{"$f":"Q10/$Q$9","v":{"$error":"#DIV/0!"}}]
{"$rows_left_out":29}
{"sheet":"!Key Ratios","index":3,"n_rows":80,"n_cols":31,"rows_kept":80,"cut":false,"hidden":true,"merged":[[6,18,6,30],[50,17,50,31],[52,17,52,31],[51,17,51,31],[31,17,31,31]]}
[]
["Название компании",{"$f":"'Balance '!D3","v":"заполнить"}]
["ИНН",{"$f":"'Balance '!D4","v":"заполнить"}]
["Вид деятельности с указанием брендов",{"$f":"'Balance '!D5","v":"заполнить"}]
[]
["Финансовые коэффициенты / Financial ratios"]
[null,null,null,null,"Reporting dates",null,null,null,null,null,null,null,null,null,null,null,null,null,"Rating for reporting date"]
["Коэффициент","Ratio","Calculation","Target",{"$f":"'Balance '!E8","v":"2018-12-31"},{"$f":"'Balance '!F8","v":"2019-03-31"},{"$f":"'Balance '!G8","v":"2019-06-30"},{"$f":"'Balance '!H8","v":"2019-09-30"},{"$f":"'Balance '!I8","v":"2019-12-31"},{"$f":"'Balance '!J8","v":"2020-03-31"},{"$f":"'Balance '!K8","v":"2020-06-30"},{"$f":"'Balance '!L8","v":"2020-09-30"},{"$f":"'Balance '!M8","v":"2020-12-31"},{"$f":"'Balance '!N8","v":"2021-03-31"},{"$f":"'Balance '!O8","v":"2021-06-30"},{"$f":"'Balance '!P8","v":"2021-09-30"},{"$f":"'Balance '!Q8","v":"2021-12-31"},null,{"$f":"'Financial ranking'!E6","v":"2018-12-31"},{"$f":"'Financial ranking'!F6","v":"2019-03-31"},{"$f":"'Financial ranking'!G6","v":"2019-06-30"},{"$f":"'Financial ranking'!H6","v":"2019-09-30"},{"$f":"'Financial ranking'!I6","v":"2019-12-31"},{"$f":"'Financial ranking'!J6","v":"2020-03-31"},{"$f":"'Financial ranking'!K6","v":"2020-06-30"},{"$f":"'Financial ranking'!L6","v":"2020-09-30"},{"$f":"'Financial ranking'!M6","v":"2020-12-31"},{"$f":"'Financial ranking'!N6","v":"2021-03-31"},{"$f":"'Financial ranking'!O6","v":"2021-06-30"},{"$f":"'Financial ranking'!P6","v":"2021-09-30"},{"$f":"'Financial ranking'!Q6","v":"2021-12-31"}]
["Уровень собственного капитала","Equity ratio (%)","Equity (Capital and Reserves / TTL balance)",">40%",{"$f":"'Balance '!E64/'Balance '!E95","v":{"$error":"#DIV/0!"}},{"$f":"'Balance '!F64/'Balance '!F95","v":{"$error":"#DIV/0!"}},{"$f":"'Balance '!G64/'Balance '!G95","v":{"$error":"#DIV/0!"}},{"$f":"'Balance '!H64/'Balance '!H95","v":{"$error":"#DIV/0!"}},{"$f":"'Balance '!I64/'Balance '!I95","v":{"$error":"#DIV/0!"}},{"$f":"'Balance '!J64/'Balance '!J95","v":{"$error":"#DIV/0!"}},{"$f":"'Balance '!K64/'Balance '!K95","v":{"$error":"#DIV/0!"}},{"$f":"'Balance '!L64/'Balance '!L95","v":{"$error":"#DIV/0!"}},{"$f":"'Balance '!M64/'Balance '!M95","v":{"$error":"#DIV/0!"}},{"$f":"'Balance '!N64/'Balance '!N95","v":{"$error":"#DIV/0!"}},{"$f":"'Balance '!O64/'Balance '!O95","v":{"$error":"#DIV/0!"}},{"$f":"'Balance '!P64/'Balance '!P95","v":{"$error":"#DIV/0!"}},{"$f":"'Balance '!Q64/'Balance '!Q95","v":{"$error":"#DIV/0!"}},null,{"$f":"'Financial ranking'!E7","v":{"$error":"#DIV/0!"}},{"$f":"'Financial ranking'!F7","v":{"$error":"#DIV/0!"}},{"$f":"'Financial ranking'!G7","v":{"$error":"#DIV/0!"}},{"$f":"'Financial ranking'!H7","v":{"$error":"#DIV/0!"}},{"$f":"'Financial ranking'!I7","v":{"$error":"#DIV/0!"}},{"$f":"'Financial ranking'!J7","v":{"$error":"#DIV/0!"}},{"$f":"'Financial ranking'!K7","v":{"$error":"#DIV/0!"}},{"$f":"'Financial ranking'!L7","v":{"$error":"#DIV/0!"}},{"$f":"'Financial ranking'!M7","v":{"$error":"#DIV/0!"}},{"$f":"'Financial ranking'!N7","v":{"$error":"#DIV/0!"}},{"$f":"'Financial ranking'!O7","v":{"$error":"#DIV/0!"}},{"$f":"'Financial ranking'!P7","v":{"$error":"#DIV/0!"}},{"$f":"'Financial ranking'!Q7","v":{"$error":"#DIV/0!"}}]
["Коэффициент текущей ликвидности ","Current liquidity ratio","Current assets / Current liabilities",">1,4",{"$f":"'Balance '!E50/'Balance '!E94","v":{"$error":"#DIV/0!"}},{"$f":"'Balance '!F50/'Balance '!F94","v":{"$error":"#DIV/0!"}},{"$f":"'Balance '!G50/'Balance '!G94","v":{"$error":"#DIV/0!"}},{"$f":"'Balance '!H50/'Balance '!H94","v":{"$error":"#DIV/0!"}},{"$f":"'Balance '!I50/'Balance '!I94","v":{"$error":"#DIV/0!"}},{"$f":"'Balance '!J50/'Balance '!J94","v":{"$error":"#DIV/0!"}},{"$f":"'Balance '!K50/'Balance '!K94","v":{"$error":"#DIV/0!"}},{"$f":"'Balance '!L50/'Balance '!L94","v":{"$error":"#DIV/0!"}},{"$f":"'Balance '!M50/'Balance '!M94","v":{"$error":"#DIV/0!"}},{"$f":"'Balance '!N50/'Balance '!N94","v":{"$error":"#DIV/0!"}},{"$f":"'Balance '!O50/'Balance '!O94","v":{"$error":"#DIV/0!"}},{"$f":"'Balance '!P50/'Balance '!P94","v":{"$error":"#DIV/0!"}},{"$f":"'Balance '!Q50/'Balance '!Q94","v":{"$error":"#DIV/0!"}},null,{"$f":"'Financial ranking'!E8","v":{"$error":"#DIV/0!"}},{"$f":"'Financial ranking'!F8","v":{"$error":"#DIV/0!"}},{"$f":"'Financial ranking'!G8","v":{"$error":"#DIV/0!"}},{"$f":"'Financial ranking'!H8","v":{"$error":"#DIV/0!"}},{"$f":"'Financial ranking'!I8","v":{"$error":"#DIV/0!"}},{"$f":"'Financial ranking'!J8","v":{"$error":"#DIV/0!"}},{"$f":"'Financial ranking'!K8","v":{"$error":"#DIV/0!"}},{"$f":"'Financial ranking'!L8","v":{"$error":"#DIV/0!"}},{"$f":"'Financial ranking'!M8","v":{"$error":"#DIV/0!"}},{"$f":"'Financial ranking'!N8","v":{"$error":"#DIV/0!"}},{"$f":"'Financial ranking'!O8","v":{"$error":"#DIV/0!"}},{"$f":"'Financial ranking'!P8","v":{"$error":"#DIV/0!"}},{"$f":"'Financial ranking'!Q8","v":{"$error":"#DIV/0!"}}]
{"$rows_left_out":71}
{"sheet":"Ranking desciption","index":4,"n_rows":11,"n_cols":4,"rows_kept":11,"cut":false,"hidden":true,"merged":[[0,1,0,2],[1,0,4,0],[1,3,4,3],[5,0,6,0],[7,0,10,0],[8,3,10,3]]}
[null,"Risk level",null,"Insolvency level"]
["Group I",1,"No risk","The company is solvent"]
[null,2,"Minimum risk"]
[null,3,"Lower than medium risk "]
[null,4,"Close to medium risk"]
["Group II",5,"Medium risk level","Poor solvency"]
[null,6,"Greater than medium risk","Inadequate solvency"]
["Group III",7,"High risk/Major problems","Insolvent/business termination possible"]
[null,8,"Technical default/Failure to perform obligations","Bankruptcy/liquidation "]
[null,9,"Bankruptcy procedure"]
{"$rows_left_out":2}
{"sheet":"Предоставить расшифровки","index":5,"n_rows":18,"n_cols":2,"rows_kept":18,"cut":false,"hidden":false,"merged":[]}
[null,"На дату 31.03.20 и на 31.03.2021"]
[1,"Основные средства"]
[2,"Запасы"]
[3,"Фин. Вложения"]
[4,"Дебиторская задолженность "]
[5,"Займы и кредиты долгосрочные (с детализацией по заемщикам, срокам и условиям (%)"]
[6,"Займы и кредиты краткосрочные (с детализацией по заемщикам, срокам и условиям (%)"]
[7,"Кредиторская задолженность"]
[]
[8,"Выручка"]
{"$rows_left_out":9}
{"sheet":"Поручитель","index":6,"n_rows":11,"n_cols":1,"rows_kept":11,"cut":false,"hidden":true,"merged":[]}
["Приложение 4.   Требования к поручителю"]
[]
["1)         Юридическое лицо, работающее не менее 2х лет "]
["(в порядке исключения и только после получения согласования по Документу делегирования полномочий возможно рассмотрение в качестве поручителя физического лица)"]
["2)         Юридическое лицо, работающее с прибылью "]
["(для физ. лица – уровень владельца бизнеса (Дилерского Центра), имеющего в собственности недвижимое и движимое"]
["3)         Сумма операционных активов (ОС + НМА + Запасы + ДЗ + Ден. средства) должна превышать сумму поручительства не менее, чем в 2 раза"]
["4)         Наличие Аудиторского заключения – как преимущество"]
["5)         Количество судебных дел, находящихся в производстве арбитражных судов и судов общей юрисдикции в отношении претендента менее 10"]
["6)         Сумма обязательств, предъявляемых к претенденту в рамках судебных производств, не превышает размер собственных активов претендента"]
{"$rows_left_out":2}
{"sheet":"Financial ranking","index":7,"n_rows":36,"n_cols":32,"rows_kept":36,"cut":false,"hidden":true,"merged":[[32,3,32,13],[4,24,5,24],[4,3,5,3],[25,3,25,13],[4,17,4,23],[12,17,12,23],[4,4,4,16]]}
[]
[null,null,null,{"$f":"'Balance '!#REF!","v":{"$error":"#REF!"}}]
[null,null,null,{"$f":"'Balance '!C3","v":"Название компании"}]
[]
[null,null,null,"Показатель / Index","Rating for repoting date",null,null,null,null,null,null,null,null,null,null,null,null,"Ratio's lower and higher values and corresponding rating",null,null,null,null,null,null," Weight of indicator"]
[null,null,null,null,{"$f":"'Balance '!E8","v":"2018-12-31"},{"$f":"'Balance '!F8","v":"2019-03-31"},{"$f":"'Balance '!G8","v":"2019-06-30"},{"$f":"'Balance '!H8","v":"2019-09-30"},{"$f":"'Balance '!I8","v":"2019-12-31"},{"$f":"'Balance '!J8","v":"2020-03-31"},{"$f":"'Balance '!K8","v":"2020-06-30"},{"$f":"'Balance '!L8","v":"2020-09-30"},{"$f":"'Balance '!M8","v":"2020-12-31"},{"$f":"'Balance '!N8","v":"2021-03-31"},{"$f":"'Balance '!O8","v":"2021-06-30"},{"$f":"'Balance '!P8","v":"2021-09-30"},{"$f":"'Balance '!Q8","v":"2021-12-31"},1,2,3,4,5,6,7]
[null,null,null,"Equity Ratio",{"$f":"IF('!Key Ratios'!E9>=$AA$7,1,IF('!Key Ratios'!E9>=$AB$7,2,IF('!Key Ratios'!E9>=$AC$7,3,IF('!Key Ratios'!E9>=$AD$7,4,IF('!Key Ratios'!E9>=$AE$7,5,IF('!Key Ratios'!E9>=$AF$7,6,7))))))","v":{"$error":"#DIV/0!"}},{"$f":"IF('!Key Ratios'!F9>=$AA$7,1,IF('!Key Ratios'!F9>=$AB$7,2,IF('!Key Ratios'!F9>=$AC$7,3,IF('!Key Ratios'!F9>=$AD$7,4,IF('!Key Ratios'!F9>=$AE$7,5,IF('!Key Ratios'!F9>=$AF$7,6,7))))))","v":{"$error":"#DIV/0!"}},{"$f":"IF('!Key Ratios'!G9>=$AA$7,1,IF('!Key Ratios'!G9>=$AB$7,2,IF('!Key Ratios'!G9>=$AC$7,3,IF('!Key Ratios'!G9>=$AD$7,4,IF('!Key Ratios'!G9>=$AE$7,5,IF('!Key Ratios'!G9>=$AF$7,6,7))))))","v":{"$error":"#DIV/0!"}},{"$f":"IF('!Key Ratios'!H9>=$AA$7,1,IF('!Key Ratios'!H9>=$AB$7,2,IF('!Key Ratios'!H9>=$AC$7,3,IF('!Key Ratios'!H9>=$AD$7,4,IF('!Key Ratios'!H9>=$AE$7,5,IF('!Key Ratios'!H9>=$AF$7,6,7))))))","v":{"$error":"#DIV/0!"}},{"$f":"IF('!Key Ratios'!I9>=$AA$7,1,IF('!Key Ratios'!I9>=$AB$7,2,IF('!Key Ratios'!I9>=$AC$7,3,IF('!Key Ratios'!I9>=$AD$7,4,IF('!Key Ratios'!I9>=$AE$7,5,IF('!Key Ratios'!I9>=$AF$7,6,7))))))","v":{"$error":"#DIV/0!"}},{"$f":"IF('!Key Ratios'!J9>=$AA$7,1,IF('!Key Ratios'!J9>=$AB$7,2,IF('!Key Ratios'!J9>=$AC$7,3,IF('!Key Ratios'!J9>=$AD$7,4,IF('!Key Ratios'!J9>=$AE$7,5,IF('!Key Ratios'!J9>=$AF$7,6,7))))))","v":{"$error":"#DIV/0!"}},{"$f":"IF('!Key Ratios'!K9>=$AA$7,1,IF('!Key Ratios'!K9>=$AB$7,2,IF('!Key Ratios'!K9>=$AC$7,3,IF('!Key Ratios'!K9>=$AD$7,4,IF('!Key Ratios'!K9>=$AE$7,5,IF('!Key Ratios'!K9>=$AF$7,6,7))))))","v":{"$error":"#DIV/0!"}},{"$f":"IF('!Key Ratios'!L9>=$AA$7,1,IF('!Key Ratios'!L9>=$AB$7,2,IF('!Key Ratios'!L9>=$AC$7,3,IF('!Key Ratios'!L9>=$AD$7,4,IF('!Key Ratios'!L9>=$AE$7,5,IF('!Key Ratios'!L9>=$AF$7,6,7))))))","v":{"$error":"#DIV/0!"}},{"$f":"IF('!Key Ratios'!M9>=$AA$7,1,IF('!Key Ratios'!M9>=$AB$7,2,IF('!Key Ratios'!M9>=$AC$7,3,IF('!Key Ratios'!M9>=$AD$7,4,IF('!Key Ratios'!M9>=$AE$7,5,IF('!Key Ratios'!M9>=$AF$7,6,7))))))","v":{"$error":"#DIV/0!"}},{"$f":"IF('!Key Ratios'!N9>=$AA$7,1,IF('!Key Ratios'!N9>=$AB$7,2,IF('!Key Ratios'!N9>=$AC$7,3,IF('!Key Ratios'!N9>=$AD$7,4,IF('!Key Ratios'!N9>=$AE$7,5,IF('!Key Ratios'!N9>=$AF$7,6,7))))))","v":{"$error":"#DIV/0!"}},{"$f":"IF('!Key Ratios'!O9>=$AA$7,1,IF('!Key Ratios'!O9>=$AB$7,2,IF('!Key Ratios'!O9>=$AC$7,3,IF('!Key Ratios'!O9>=$AD$7,4,IF('!Key Ratios'!O9>=$AE$7,5,IF('!Key Ratios'!O9>=$AF$7,6,7))))))","v":{"$error":"#DIV/0!"}},{"$f":"IF('!Key Ratios'!P9>=$AA$7,1,IF('!Key Ratios'!P9>=$AB$7,2,IF('!Key Ratios'!P9>=$AC$7,3,IF('!Key Ratios'!P9>=$AD$7,4,IF('!Key Ratios'!P9>=$AE$7,5,IF('!Key Ratios'!P9>=$AF$7,6,7))))))","v":{"$error":"#DIV/0!"}},{"$f":"IF('!Key Ratios'!Q9>=$AA$7,1,IF('!Key Ratios'!Q9>=$AB$7,2,IF('!Key Ratios'!Q9>=$AC$7,3,IF('!Key Ratios'!Q9>=$AD$7,4,IF('!Key Ratios'!Q9>=$AE$7,5,IF('!Key Ratios'!Q9>=$AF$7,6,7))))))","v":{"$error":"#DIV/0!"}},">0.4","0.3 - 0.4","0.2 - 0.3","0.1 - 0.2","0 - 0.1","(-0.025) - 0","<(-0.025)",0.4,null,0.4,0.3,0.2,0.1,0,-2.5000000000000001E-2]
[null,null,null,"Current Ratio",{"$f":"IF('!Key Ratios'!E10>=$AA$8,1,IF('!Key Ratios'!E10>=$AB$8,2,IF('!Key Ratios'!E10>=$AC$8,3,IF('!Key Ratios'!E10>=$AD$8,4,IF('!Key Ratios'!E10>=$AE$8,5,IF('!Key Ratios'!E10>=$AF$8,6,7))))))","v":{"$error":"#DIV/0!"}},{"$f":"IF('!Key Ratios'!F10>=$AA$8,1,IF('!Key Ratios'!F10>=$AB$8,2,IF('!Key Ratios'!F10>=$AC$8,3,IF('!Key Ratios'!F10>=$AD$8,4,IF('!Key Ratios'!F10>=$AE$8,5,IF('!Key Ratios'!F10>=$AF$8,6,7))))))","v":{"$error":"#DIV/0!"}},{"$f":"IF('!Key Ratios'!G10>=$AA$8,1,IF('!Key Ratios'!G10>=$AB$8,2,IF('!Key Ratios'!G10>=$AC$8,3,IF('!Key Ratios'!G10>=$AD$8,4,IF('!Key Ratios'!G10>=$AE$8,5,IF('!Key Ratios'!G10>=$AF$8,6,7))))))","v":{"$error":"#DIV/0!"}},{"$f":"IF('!Key Ratios'!H10>=$AA$8,1,IF('!Key Ratios'!H10>=$AB$8,2,IF('!Key Ratios'!H10>=$AC$8,3,IF('!Key Ratios'!H10>=$AD$8,4,IF('!Key Ratios'!H10>=$AE$8,5,IF('!Key Ratios'!H10>=$AF$8,6,7))))))","v":{"$error":"#DIV/0!"}},{"$f":"IF('!Key Ratios'!I10>=$AA$8,1,IF('!Key Ratios'!I10>=$AB$8,2,IF('!Key Ratios'!I10>=$AC$8,3,IF('!Key Ratios'!I10>=$AD$8,4,IF('!Key Ratios'!I10>=$AE$8,5,IF('!Key Ratios'!I10>=$AF$8,6,7))))))","v":{"$error":"#DIV/0!"}},{"$f":"IF('!Key Ratios'!J10>=$AA$8,1,IF('!Key Ratios'!J10>=$AB$8,2,IF('!Key Ratios'!J10>=$AC$8,3,IF('!Key Ratios'!J10>=$AD$8,4,IF('!Key Ratios'!J10>=$AE$8,5,IF('!Key Ratios'!J10>=$AF$8,6,7))))))","v":{"$error":"#DIV/0!"}},{"$f":"IF('!Key Ratios'!K10>=$AA$8,1,IF('!Key Ratios'!K10>=$AB$8,2,IF('!Key Ratios'!K10>=$AC$8,3,IF('!Key Ratios'!K10>=$AD$8,4,IF('!Key Ratios'!K10>=$AE$8,5,IF('!Key Ratios'!K10>=$AF$8,6,7))))))","v":{"$error":"#DIV/0!"}},{"$f":"IF('!Key Ratios'!L10>=$AA$8,1,IF('!Key Ratios'!L10>=$AB$8,2,IF('!Key Ratios'!L10>=$AC$8,3,IF('!Key Ratios'!L10>=$AD$8,4,IF('!Key Ratios'!L10>=$AE$8,5,IF('!Key Ratios'!L10>=$AF$8,6,7))))))","v":{"$error":"#DIV/0!"}},{"$f":"IF('!Key Ratios'!M10>=$AA$8,1,IF('!Key Ratios'!M10>=$AB$8,2,IF('!Key Ratios'!M10>=$AC$8,3,IF('!Key Ratios'!M10>=$AD$8,4,IF('!Key Ratios'!M10>=$AE$8,5,IF('!Key Ratios'!M10>=$AF$8,6,7))))))","v":{"$error":"#DIV/0!"}},{"$f":"IF('!Key Ratios'!N10>=$AA$8,1,IF('!Key Ratios'!N10>=$AB$8,2,IF('!Key Ratios'!N10>=$AC$8,3,IF('!Key Ratios'!N10>=$AD$8,4,IF('!Key Ratios'!N10>=$AE$8,5,IF('!Key Ratios'!N10>=$AF$8,6,7))))))","v":{"$error":"#DIV/0!"}},{"$f":"IF('!Key Ratios'!O10>=$AA$8,1,IF('!Key Ratios'!O10>=$AB$8,2,IF('!Key Ratios'!O10>=$AC$8,3,IF('!Key Ratios'!O10>=$AD$8,4,IF('!Key Ratios'!O10>=$AE$8,5,IF('!Key Ratios'!O10>=$AF$8,6,7))))))","v":{"$error":"#DIV/0!"}},{"$f":"IF('!Key Ratios'!P10>=$AA$8,1,IF('!Key Ratios'!P10>=$AB$8,2,IF('!Key Ratios'!P10>=$AC$8,3,IF('!Key Ratios'!P10>=$AD$8,4,IF('!Key Ratios'!P10>=$AE$8,5,IF('!Key Ratios'!P10>=$AF$8,6,7))))))","v":{"$error":"#DIV/0!"}},{"$f":"IF('!Key Ratios'!Q10>=$AA$8,1,IF('!Key Ratios'!Q10>=$AB$8,2,IF('!Key Ratios'!Q10>=$AC$8,3,IF('!Key Ratios'!Q10>=$AD$8,4,IF('!Key Ratios'!Q10>=$AE$8,5,IF('!Key Ratios'!Q10>=$AF$8,6,7))))))","v":{"$error":"#DIV/0!"}},">1.4","1,25 - 1,4","1,1 - 1,25","1 - 1,1","0,9 - 1","0,8 - 0,9","<0.8",0.2,null,1.4,1.25,1.1000000000000001,1,0.9,0.8]
[null,null,null,"ISCR",{"$f":"IF('!Key Ratios'!E11>=$AA$9,1,IF('!Key Ratios'!E11>=$AB$9,2,IF('!Key Ratios'!E11>=$AC$9,3,IF('!Key Ratios'!E11>=$AD$9,4,IF('!Key Ratios'!E11>=$AE$9,5,IF('!Key Ratios'!E11>=$AF$9,6,7))))))","v":{"$error":"#DIV/0!"}},{"$f":"IF('!Key Ratios'!F11>=$AA$9,1,IF('!Key Ratios'!F11>=$AB$9,2,IF('!Key Ratios'!F11>=$AC$9,3,IF('!Key Ratios'!F11>=$AD$9,4,IF('!Key Ratios'!F11>=$AE$9,5,IF('!Key Ratios'!F11>=$AF$9,6,7))))))","v":{"$error":"#DIV/0!"}},{"$f":"IF('!Key Ratios'!G11>=$AA$9,1,IF('!Key Ratios'!G11>=$AB$9,2,IF('!Key Ratios'!G11>=$AC$9,3,IF('!Key Ratios'!G11>=$AD$9,4,IF('!Key Ratios'!G11>=$AE$9,5,IF('!Key Ratios'!G11>=$AF$9,6,7))))))","v":{"$error":"#DIV/0!"}},{"$f":"IF('!Key Ratios'!H11>=$AA$9,1,IF('!Key Ratios'!H11>=$AB$9,2,IF('!Key Ratios'!H11>=$AC$9,3,IF('!Key Ratios'!H11>=$AD$9,4,IF('!Key Ratios'!H11>=$AE$9,5,IF('!Key Ratios'!H11>=$AF$9,6,7))))))","v":{"$error":"#DIV/0!"}},{"$f":"IF('!Key Ratios'!I11>=$AA$9,1,IF('!Key Ratios'!I11>=$AB$9,2,IF('!Key Ratios'!I11>=$AC$9,3,IF('!Key Ratios'!I11>=$AD$9,4,IF('!Key Ratios'!I11>=$AE$9,5,IF('!Key Ratios'!I11>=$AF$9,6,7))))))","v":{"$error":"#DIV/0!"}},{"$f":"IF('!Key Ratios'!J11>=$AA$9,1,IF('!Key Ratios'!J11>=$AB$9,2,IF('!Key Ratios'!J11>=$AC$9,3,IF('!Key Ratios'!J11>=$AD$9,4,IF('!Key Ratios'!J11>=$AE$9,5,IF('!Key Ratios'!J11>=$AF$9,6,7))))))","v":{"$error":"#DIV/0!"}},{"$f":"IF('!Key Ratios'!K11>=$AA$9,1,IF('!Key Ratios'!K11>=$AB$9,2,IF('!Key Ratios'!K11>=$AC$9,3,IF('!Key Ratios'!K11>=$AD$9,4,IF('!Key Ratios'!K11>=$AE$9,5,IF('!Key Ratios'!K11>=$AF$9,6,7))))))","v":{"$error":"#DIV/0!"}},{"$f":"IF('!Key Ratios'!L11>=$AA$9,1,IF('!Key Ratios'!L11>=$AB$9,2,IF('!Key Ratios'!L11>=$AC$9,3,IF('!Key Ratios'!L11>=$AD$9,4,IF('!Key Ratios'!L11>=$AE$9,5,IF('!Key Ratios'!L11>=$AF$9,6,7))))))","v":{"$error":"#DIV/0!"}},{"$f":"IF('!Key Ratios'!M11>=$AA$9,1,IF('!Key Ratios'!M11>=$AB$9,2,IF('!Key Ratios'!M11>=$AC$9,3,IF('!Key Ratios'!M11>=$AD$9,4,IF('!Key Ratios'!M11>=$AE$9,5,IF('!Key Ratios'!M11>=$AF$9,6,7))))))","v":{"$error":"#DIV/0!"}},{"$f":"IF('!Key Ratios'!N11>=$AA$9,1,IF('!Key Ratios'!N11>=$AB$9,2,IF('!Key Ratios'!N11>=$AC$9,3,IF('!Key Ratios'!N11>=$AD$9,4,IF('!Key Ratios'!N11>=$AE$9,5,IF('!Key Ratios'!N11>=$AF$9,6,7))))))","v":{"$error":"#DIV/0!"}},{"$f":"IF('!Key Ratios'!O11>=$AA$9,1,IF('!Key Ratios'!O11>=$AB$9,2,IF('!Key Ratios'!O11>=$AC$9,3,IF('!Key Ratios'!O11>=$AD$9,4,IF('!Key Ratios'!O11>=$AE$9,5,IF('!Key Ratios'!O11>=$AF$9,6,7))))))","v":{"$error":"#DIV/0!"}},{"$f":"IF('!Key Ratios'!P11>=$AA$9,1,IF('!Key Ratios'!P11>=$AB$9,2,IF('!Key Ratios'!P11>=$AC$9,3,IF('!Key Ratios'!P11>=$AD$9,4,IF('!Key Ratios'!P11>=$AE$9,5,IF('!Key Ratios'!P11>=$AF$9,6,7))))))","v":{"$error":"#DIV/0!"}},{"$f":"IF('!Key Ratios'!Q11>=$AA$9,1,IF('!Key Ratios'!Q11>=$AB$9,2,IF('!Key Ratios'!Q11>=$AC$9,3,IF('!Key Ratios'!Q11>=$AD$9,4,IF('!Key Ratios'!Q11>=$AE$9,5,IF('!Key Ratios'!Q11>=$AF$9,6,7))))))","v":{"$error":"#DIV/0!"}},">4.5","3.5 - 4.5","2.5 - 3.5","1.5 - 2.5","1 - 1,5","0.5 - 1","<0.5",0.2,null,4.5,3.5,2.5,1.5,1,0.5]
[null,null,null,"EBT Profit ratio  ",{"$f":"IF('!Key Ratios'!E12>=$AA$10,1,IF('!Key Ratios'!E12>=$AB$10,2,IF('!Key Ratios'!E12>=$AC$10,3,IF('!Key Ratios'!E12>=$AD$10,4,IF('!Key Ratios'!E12>=$AE$10,5,IF('!Key Ratios'!E12>=$AF$10,6,7))))))","v":{"$error":"#DIV/0!"}},{"$f":"IF('!Key Ratios'!F12>=$AA$10,1,IF('!Key Ratios'!F12>=$AB$10,2,IF('!Key Ratios'!F12>=$AC$10,3,IF('!Key Ratios'!F12>=$AD$10,4,IF('!Key Ratios'!F12>=$AE$10,5,IF('!Key Ratios'!F12>=$AF$10,6,7))))))","v":{"$error":"#DIV/0!"}},{"$f":"IF('!Key Ratios'!G12>=$AA$10,1,IF('!Key Ratios'!G12>=$AB$10,2,IF('!Key Ratios'!G12>=$AC$10,3,IF('!Key Ratios'!G12>=$AD$10,4,IF('!Key Ratios'!G12>=$AE$10,5,IF('!Key Ratios'!G12>=$AF$10,6,7))))))","v":{"$error":"#DIV/0!"}},{"$f":"IF('!Key Ratios'!H12>=$AA$10,1,IF('!Key Ratios'!H12>=$AB$10,2,IF('!Key Ratios'!H12>=$AC$10,3,IF('!Key Ratios'!H12>=$AD$10,4,IF('!Key Ratios'!H12>=$AE$10,5,IF('!Key Ratios'!H12>=$AF$10,6,7))))))","v":{"$error":"#DIV/0!"}},{"$f":"IF('!Key Ratios'!I12>=$AA$10,1,IF('!Key Ratios'!I12>=$AB$10,2,IF('!Key Ratios'!I12>=$AC$10,3,IF('!Key Ratios'!I12>=$AD$10,4,IF('!Key Ratios'!I12>=$AE$10,5,IF('!Key Ratios'!I12>=$AF$10,6,7))))))","v":{"$error":"#DIV/0!"}},{"$f":"IF('!Key Ratios'!J12>=$AA$10,1,IF('!Key Ratios'!J12>=$AB$10,2,IF('!Key Ratios'!J12>=$AC$10,3,IF('!Key Ratios'!J12>=$AD$10,4,IF('!Key Ratios'!J12>=$AE$10,5,IF('!Key Ratios'!J12>=$AF$10,6,7))))))","v":{"$error":"#DIV/0!"}},{"$f":"IF('!Key Ratios'!K12>=$AA$10,1,IF('!Key Ratios'!K12>=$AB$10,2,IF('!Key Ratios'!K12>=$AC$10,3,IF('!Key Ratios'!K12>=$AD$10,4,IF('!Key Ratios'!K12>=$AE$10,5,IF('!Key Ratios'!K12>=$AF$10,6,7))))))","v":{"$error":"#DIV/0!"}},{"$f":"IF('!Key Ratios'!L12>=$AA$10,1,IF('!Key Ratios'!L12>=$AB$10,2,IF('!Key Ratios'!L12>=$AC$10,3,IF('!Key Ratios'!L12>=$AD$10,4,IF('!Key Ratios'!L12>=$AE$10,5,IF('!Key Ratios'!L12>=$AF$10,6,7))))))","v":{"$error":"#DIV/0!"}},{"$f":"IF('!Key Ratios'!M12>=$AA$10,1,IF('!Key Ratios'!M12>=$AB$10,2,IF('!Key Ratios'!M12>=$AC$10,3,IF('!Key Ratios'!M12>=$AD$10,4,IF('!Key Ratios'!M12>=$AE$10,5,IF('!Key Ratios'!M12>=$AF$10,6,7))))))","v":{"$error":"#DIV/0!"}},{"$f":"IF('!Key Ratios'!N12>=$AA$10,1,IF('!Key Ratios'!N12>=$AB$10,2,IF('!Key Ratios'!N12>=$AC$10,3,IF('!Key Ratios'!N12>=$AD$10,4,IF('!Key Ratios'!N12>=$AE$10,5,IF('!Key Ratios'!N12>=$AF$10,6,7))))))","v":{"$error":"#DIV/0!"}},{"$f":"IF('!Key Ratios'!O12>=$AA$10,1,IF('!Key Ratios'!O12>=$AB$10,2,IF('!Key Ratios'!O12>=$AC$10,3,IF('!Key Ratios'!O12>=$AD$10,4,IF('!Key Ratios'!O12>=$AE$10,5,IF('!Key Ratios'!O12>=$AF$10,6,7))))))","v":{"$error":"#DIV/0!"}},{"$f":"IF('!Key Ratios'!P12>=$AA$10,1,IF('!Key Ratios'!P12>=$AB$10,2,IF('!Key Ratios'!P12>=$AC$10,3,IF('!Key Ratios'!P12>=$AD$10,4,IF('!Key Ratios'!P12>=$AE$10,5,IF('!Key Ratios'!P12>=$AF$10,6,7))))))","v":{"$error":"#DIV/0!"}},{"$f":"IF('!Key Ratios'!Q12>=$AA$10,1,IF('!Key Ratios'!Q12>=$AB$10,2,IF('!Key Ratios'!Q12>=$AC$10,3,IF('!Key Ratios'!Q12>=$AD$10,4,IF('!Key Ratios'!Q12>=$AE$10,5,IF('!Key Ratios'!Q12>=$AF$10,6,7))))))","v":{"$error":"#DIV/0!"}},">3","2.25 - 3","1,5 - 2.25","0.75 - 1.5","0.25 - 0.75","(-0.5) - 0.25","<(-0.5)",0.2,null,0.03,2.2499999999999999E-2,1.4999999999999999E-2,7.4999999999999997E-3,2.5000000000000001E-3,-5.0000000000000001E-3]
{"$rows_left_out":26}